{"text_format":"2","workbook":"xlsx","n_sheets":6,"sheets":["HeroescallConfig","Sheet1","召唤库","普通召唤","武器召唤","道具表"],"not_rendered":{"charts":0,"images":1,"macros":0,"external_links":0,"defined_names":0,"comments":2,"pivot_tables":0},"unopened":[],"bounds":{"document_bytes":16777216,"sheet_cells":100000,"run_cost":"one","rows_first":2000,"rows_last":500,"rows_between":2000,"halvings":0,"cell_chars":16384,"cell_head_chars":4096},"cells_cut":0,"cells_raw":0,"read":"whole","date_system":"1900"}

{"sheet":"HeroescallConfig","index":0,"n_rows":23,"n_cols":11,"rows_kept":23,"cut":false,"hidden":false,"merged":[]}
["ID[csknu]","points[csn]","enter[sn]","must[sn]","chance[sn]","luckya[sn]","luckyb[sn]","luckyn[sn]","priority[sn]","type[csn]"]
["奖池","库ID","入库积分","必出积分","初始概率%","幸运参数a","幸运参数b","幸运参数n","调取优先级","召唤类型"]
[10001,1010,0,0,10000,0,0,0,1,1,"高级材料掉落"]
[10002,1001,0,0,4000,0,0,0,2,1,"初始英雄库（白色，保底基础奖池库）"]
[10003,1002,0,50,2000,0.1,20,2.86,3,1,"绿色英雄库（每次抽出都有20%概率抽取绿色卡）"]
[10004,1003,10,80,1000,1.1000000000000001,2,2.12,4,1,"蓝色英雄库（5入15次必出，15次内必出一张蓝卡）"]
[10005,1004,50,200,10,1.1000000000000001,6.5,1.8,5,1,"紫色英雄库（10连必出库，单抽15次开始入库，20次必出）"]
[10006,1005,10,50,500,0.2,27,2.9,6,1,"技能碎片库（10入20次必出，单抽10次开始入口，20次必出一次技能碎片）"]
[10007,1006,40,120,50,1.5,4.5,2,7,1,"完整技能卡牌（50入100次必出，100次抽取内必定出一张完整技能卡牌）"]
[20004,2004,0,0,10000,0,0,0,1,2,"白色材料库"]
[20005,2005,0,0,1500,0,0,0,2,2,"绿色材料库"]
[20006,2006,0,0,1500,0,0,0,3,2,"蓝色材料库"]
[20007,2007,0,0,1000,0,0,0,4,2,"紫色材料库"]
[20001,2001,30,200,100,10,6.6,1.32,5,2,"普通召唤-初始英雄库（白色，保底基础奖池库）"]
[20002,2002,50,300,100,6,4.5,1.32,6,2,"普通召唤-绿色英雄库（每次抽出都有15%概率抽取绿色卡）"]
[20003,2003,70,600,10,4,4.8600000000000003,1.2,7,2,"普通召唤-蓝色英雄库（5入20次必出，20次内必出一张蓝卡）"]
[30001,5007,0,0,10000,0,0,0,1,3,"白色卷轴库"]
[30002,5008,0,0,3000,0,0,0,2,3,"绿色卷轴库"]
[30003,5009,0,0,3000,0,0,0,3,3,"蓝色卷轴库"]
[30004,5001,0,0,2000,0,0,0,4,3,"初始装备库（白色装备，保底基础奖池库）"]
[30005,5002,0,30,100,100,1,1.3,5,3,"绿色装备库（每次抽都有20%概率抽取绿色卡）"]
[30006,5003,15,50,50,1.3,2,2.52,6,3,"蓝色装备库（5入15次必出，15次内必出一张蓝装）"]
[30007,5004,30,100,10,0.05,1,2.8712,7,3,"紫色装备库（10连必出库，单抽8次开始入库，10次必出）"]

{"sheet":"Sheet1","index":1,"n_rows":32,"n_cols":13,"rows_kept":32,"cut":false,"hidden":false,"merged":[[1,2,1,5],[1,9,1,12],[2,0,6,0],[2,7,6,7],[7,0,11,0],[7,7,11,7]]}
[]
[null,"日常活跃宝箱","奖励",{"$nulls":5},"周常活跃宝箱","奖励"]
["0-50级","活跃值20","钻石",10,"队伍经验",1000,null,"0-50级","活跃值20","金币",10000,"卷轴随机箱",10]
[null,"活跃值40","抽奖卷",1,"队伍经验",1000,null,null,"活跃值40","钻石",100,"经验石",50]
[null,"活跃值60","钻石",30,"队伍经验",1000,null,null,"活跃值60","高级抽奖卷",5,"技能书",50]
[null,"活跃值80","抽奖卷",1,"队伍经验",1000,null,null,"活跃值80","天赋石",1,"卷轴随机箱",20]
[null,"活跃值100","钻石",50,"队伍经验",1000,null,null,"活跃值100","钻石",300,"金币",50000]
["51-120级","活跃值20","钻石",10,"队伍经验",5000,null,"51-120级","活跃值20","金币",30000,"卷轴随机箱",15]
[null,"活跃值40","抽奖卷",1,"队伍经验",5000,null,null,"活跃值40","钻石",100,"经验石",60]
[null,"活跃值60","钻石",30,"队伍经验",5000,null,null,"活跃值60","高级抽奖卷",10,"技能书",80]
[null,"活跃值80","高级抽奖卷",1,"队伍经验",5000,null,null,"活跃值80","天赋石",1,"卷轴随机箱",30]
[null,"活跃值100","钻石",50,"队伍经验",5000,null,null,"活跃值100","钻石",300,"金币",100000]
[]
[]
[]
[]
[]
[]
["奖池","库ID","入库积分","必出积分","初始概率%","幸运参数","调取优先级","召唤类型"]
[10001,1001,0,0,10000,0,0,0,1,1,"初始英雄库（白色，保底基础奖池库）"]
[10002,1002,0,50,2000,0,0,0,2,1,"绿色英雄库（每次抽出都有20%概率抽取绿色卡）"]
[10003,1003,10,80,1000,7,2,3.11,3,1,"蓝色英雄库（5入15次必出，15次内必出一张蓝卡）"]
[10004,1004,50,200,10,500,0,0,4,1,"紫色英雄库（10连必出库，单抽15次开始入库，20次必出）"]
[10005,1005,10,50,150,150,0,0,5,1,"技能碎片库（10入20次必出，单抽10次开始入口，20次必出一次技能碎片）"]
[10006,1006,50,200,100,100,0,0,6,1,"完整技能卡牌（50入100次必出，100次抽取内必定出一张完整技能卡牌）"]
[20004,2004,0,0,10000,0,0,0,1,2,"白色材料库"]
[20005,2005,0,0,1500,0,0,0,2,2,"绿色材料库"]
[20006,2006,0,0,1000,0,0,0,3,2,"蓝色材料库"]
[20007,2007,0,0,300,0,0,0,4,2,"紫色材料库"]
[20001,2001,30,200,100,10,0,0,5,2,"普通召唤-初始英雄库（白色，保底基础奖池库,30入60出）"]
[20002,2002,50,300,100,10,0,0,6,2,"普通召唤-绿色英雄库（45入75出）"]
[20003,2003,100,1000,100,10,0,0,7,2,"普通召唤-蓝色英雄库（50入100出）"]

{"sheet":"召唤库","index":2,"n_rows":86,"n_cols":20,"rows_kept":86,"cut":false,"hidden":false,"merged":[]}
["白色英雄库",1001,{"$nulls":5},"紫色英雄库",null,1004,{"$nulls":4},"技能碎片库",1005]
[null,"名称","ID","数量下限","数量上限","权重",null,null,"名称","ID","数量下限","数量上限","权重",null,null,"名称","ID","数量下限","数量上限","权重"]
[null,{"$f":"VLOOKUP(C3,道具表!$A:$B,2,0)","v":"枪兵白"},10101,1,1,2000,null,null,{"$f":"VLOOKUP(J3,道具表!$A:$B,2,0)","v":"枪兵紫"},10104,1,1,1400,null,null,{"$f":"VLOOKUP(Q3,道具表!$A:$B,2,0)","v":"连锁闪电碎片"},150000,1,1,1000]
[null,{"$f":"VLOOKUP(C4,道具表!$A:$B,2,0)","v":"火枪白"},10301,1,1,2000,null,null,{"$f":"VLOOKUP(J4,道具表!$A:$B,2,0)","v":"火枪紫"},10304,1,1,1400,null,null,{"$f":"VLOOKUP(Q4,道具表!$A:$B,2,0)","v":"龙卷风碎片"},150003,1,1,1000]
[null,{"$f":"VLOOKUP(C5,道具表!$A:$B,2,0)","v":"小丑白"},10501,1,1,2000,null,null,{"$f":"VLOOKUP(J5,道具表!$A:$B,2,0)","v":"小丑紫"},10504,1,1,1400,null,null,{"$f":"VLOOKUP(Q5,道具表!$A:$B,2,0)","v":"冰锥碎片"},150004,1,1,0]
[null,{"$f":"VLOOKUP(C6,道具表!$A:$B,2,0)","v":"史莱姆白"},12501,1,1,2000,null,null,{"$f":"VLOOKUP(J6,道具表!$A:$B,2,0)","v":"史莱姆紫"},12504,1,1,1400,null,null,{"$f":"VLOOKUP(Q6,道具表!$A:$B,2,0)","v":"祷言碎片"},150002,1,1,2000]
[null,{"$f":"VLOOKUP(C7,道具表!$A:$B,2,0)","v":{"$error":"#N/A"}},{"$nulls":6},{"$f":"VLOOKUP(J7,道具表!$A:$B,2,0)","v":"阿拉丁紫"},10804,1,1,1400,null,null,{"$f":"VLOOKUP(Q7,道具表!$A:$B,2,0)","v":"恢复碎片"},150006,1,1,2000]
[null,{"$f":"VLOOKUP(C8,道具表!$A:$B,2,0)","v":"黑魔王白"},10901,1,1,400,null,null,{"$f":"VLOOKUP(J8,道具表!$A:$B,2,0)","v":"黑魔王紫"},10904,1,1,300,null,null,{"$f":"VLOOKUP(Q8,道具表!$A:$B,2,0)","v":"圣盾碎片"},150007,1,1,2000]
[null,{"$f":"VLOOKUP(C9,道具表!$A:$B,2,0)","v":"萨莉白"},11001,1,1,400,null,null,{"$f":"VLOOKUP(J9,道具表!$A:$B,2,0)","v":"萨莉紫"},11004,1,1,300,null,null,{"$f":"VLOOKUP(Q9,道具表!$A:$B,2,0)","v":"愤怒碎片"},150001,1,1,2000]
[null,{"$f":"VLOOKUP(C10,道具表!$A:$B,2,0)","v":"巨汉白"},11101,1,1,400,null,null,{"$f":"VLOOKUP(J10,道具表!$A:$B,2,0)","v":"巨汉紫"},11104,1,1,300,{"$nulls":6},{"$f":"SUM(T3:T9)","v":10000}]
[null,{"$f":"VLOOKUP(C11,道具表!$A:$B,2,0)","v":"布鲁斯白"},12001,1,1,400,null,null,{"$f":"VLOOKUP(J11,道具表!$A:$B,2,0)","v":"布鲁斯紫"},12004,1,1,300]
[null,{"$f":"VLOOKUP(C12,道具表!$A:$B,2,0)","v":{"$error":"#N/A"}},{"$nulls":6},{"$f":"VLOOKUP(J12,道具表!$A:$B,2,0)","v":"奥利尔紫"},11204,1,1,300]
[null,{"$f":"VLOOKUP(C13,道具表!$A:$B,2,0)","v":{"$error":"#N/A"}},{"$nulls":6},{"$f":"VLOOKUP(J13,道具表!$A:$B,2,0)","v":"露娜紫"},11504,1,1,300,null,"完整技能库",1006]
[null,{"$f":"VLOOKUP(C14,道具表!$A:$B,2,0)","v":{"$error":"#N/A"}},{"$nulls":6},{"$f":"VLOOKUP(J14,道具表!$A:$B,2,0)","v":"玛格尼斯紫"},11604,1,1,300,null,null,"名称","ID","数量下限","数量上限","权重"]
[null,{"$f":"VLOOKUP(C15,道具表!$A:$B,2,0)","v":"特查拉白"},10601,1,1,400,null,null,{"$f":"VLOOKUP(J15,道具表!$A:$B,2,0)","v":"特查拉紫"},10604,1,1,300,null,null,{"$f":"VLOOKUP(Q15,道具表!$A:$B,2,0)","v":"连锁闪电"},20101,1,1,1000]
[null,{"$f":"VLOOKUP(C16,道具表!$A:$B,2,0)","v":{"$error":"#N/A"}},{"$nulls":6},{"$f":"VLOOKUP(J16,道具表!$A:$B,2,0)","v":"浣熊卫队紫"},12104,1,1,100,null,null,{"$f":"VLOOKUP(Q16,道具表!$A:$B,2,0)","v":"龙卷风"},20401,1,1,1000]
[null,{"$f":"VLOOKUP(C17,道具表!$A:$B,2,0)","v":{"$error":"#N/A"}},{"$nulls":6},{"$f":"VLOOKUP(J17,道具表!$A:$B,2,0)","v":"玛法里奥紫"},11304,1,1,100,null,null,{"$f":"VLOOKUP(Q17,道具表!$A:$B,2,0)","v":"冰锥"},20501,1,1,0]
[null,{"$f":"VLOOKUP(C18,道具表!$A:$B,2,0)","v":{"$error":"#N/A"}},{"$nulls":6},{"$f":"VLOOKUP(J18,道具表!$A:$B,2,0)","v":"罗宾紫"},10404,1,1,100,null,null,{"$f":"VLOOKUP(Q18,道具表!$A:$B,2,0)","v":"流星火雨"},20601,1,1,2000]
[null,{"$f":"VLOOKUP(C19,道具表!$A:$B,2,0)","v":{"$error":"#N/A"}},{"$nulls":6},{"$f":"VLOOKUP(J19,道具表!$A:$B,2,0)","v":"希瓦娜紫"},11704,1,1,100,null,null,{"$f":"VLOOKUP(Q19,道具表!$A:$B,2,0)","v":"恢复祷言"},20701,1,1,2000]
[null,{"$f":"VLOOKUP(C20,道具表!$A:$B,2,0)","v":{"$error":"#N/A"}},{"$nulls":6},{"$f":"VLOOKUP(J20,道具表!$A:$B,2,0)","v":"铁皮人紫"},11904,1,1,100,null,null,{"$f":"VLOOKUP(Q20,道具表!$A:$B,2,0)","v":"圣盾"},20801,1,1,2000]
[null,{"$f":"VLOOKUP(C21,道具表!$A:$B,2,0)","v":{"$error":"#N/A"}},{"$nulls":6},{"$f":"VLOOKUP(J21,道具表!$A:$B,2,0)","v":"宇智波紫"},10704,1,1,100,null,null,{"$f":"VLOOKUP(Q21,道具表!$A:$B,2,0)","v":"愤怒"},20201,1,1,2000]
[{"$nulls":5},{"$f":"SUM(F3:F21)","v":10000},{"$nulls":6},{"$f":"SUM(M3:M21)","v":10000},{"$nulls":6},{"$f":"SUM(T15:T21)","v":10000}]
[]
[]
[null,null,{"$f":"_xlfn.TEXTJOIN(\"^\",,C3:C21)","v":"10101^10301^10501^12501^10901^11001^11101^12001^10601"},{"$f":"_xlfn.TEXTJOIN(\"^\",,D3:D21)","v":"1^1^1^1^1^1^1^1^1"},{"$f":"_xlfn.TEXTJOIN(\"^\",,E3:E21)","v":"1^1^1^1^1^1^1^1^1"},{"$f":"_xlfn.TEXTJOIN(\"^\",,F3:F21)","v":"2000^2000^2000^2000^400^400^400^400^400"}]
[]
[{"$nulls":14},"紫色狗粮召唤库",1007]
[{"$nulls":15},"名称","ID","数量下限","数量上限","权重"]
[{"$nulls":15},{"$f":"VLOOKUP(Q29,道具表!$A:$B,2,0)","v":"枪兵紫"},10104,1,1,2000]
["绿色英雄库",1002,{"$nulls":13},{"$f":"VLOOKUP(Q30,道具表!$A:$B,2,0)","v":"火枪紫"},10304,1,1,2000]
[null,"名称","ID","数量下限","数量上限","权重",{"$nulls":9},{"$f":"VLOOKUP(Q31,道具表!$A:$B,2,0)","v":"小丑紫"},10504,1,1,1500]
[null,{"$f":"VLOOKUP(C32,道具表!A:B,2,0)","v":"枪兵绿"},10102,1,1,2400,null,"紫S英雄库",{"$nulls":7},{"$f":"VLOOKUP(Q32,道具表!$A:$B,2,0)","v":"史莱姆紫"},12504,1,1,1500]
[null,{"$f":"VLOOKUP(C33,道具表!A:B,2,0)","v":"火枪绿"},10302,1,1,2300,null,null,"名称","ID","数量下限","数量上限","权重",null,null,{"$f":"VLOOKUP(Q33,道具表!$A:$B,2,0)","v":"阿拉丁紫"},10804,1,1,1500]
[null,{"$f":"VLOOKUP(C34,道具表!A:B,2,0)","v":"小丑绿"},10502,1,1,2300,null,null,{"$f":"VLOOKUP(J34,道具表!$A:$B,2,0)","v":"枪兵紫S"},10105,1,1,1400,null,null,{"$f":"VLOOKUP(Q34,道具表!$A:$B,2,0)","v":"布鲁斯紫"},12004,1,1,1500]
[null,{"$f":"VLOOKUP(C35,道具表!A:B,2,0)","v":"史莱姆绿"},12502,1,1,1000,null,null,{"$f":"VLOOKUP(J35,道具表!$A:$B,2,0)","v":"火枪紫S"},10305,1,1,1400]
[null,{"$f":"VLOOKUP(C36,道具表!A:B,2,0)","v":"阿拉丁绿"},10802,1,1,100,null,null,{"$f":"VLOOKUP(J36,道具表!$A:$B,2,0)","v":"小丑紫S"},10505,1,1,1400,{"$nulls":6},{"$f":"SUM(T29:T35)","v":10000}]
[null,{"$f":"VLOOKUP(C37,道具表!A:B,2,0)","v":"黑魔王绿"},10902,1,1,300,null,null,{"$f":"VLOOKUP(J37,道具表!$A:$B,2,0)","v":"史莱姆紫S"},12505,1,1,1400]
[null,{"$f":"VLOOKUP(C38,道具表!A:B,2,0)","v":"萨莉绿"},11002,1,1,300,null,null,{"$f":"VLOOKUP(J38,道具表!$A:$B,2,0)","v":"阿拉丁紫S"},10805,1,1,1400]
[null,{"$f":"VLOOKUP(C39,道具表!A:B,2,0)","v":"巨汉绿"},11102,1,1,300,null,null,{"$f":"VLOOKUP(J39,道具表!$A:$B,2,0)","v":"黑魔王紫S"},10905,1,1,300,null,"紫色召唤库",1008]
[null,{"$f":"VLOOKUP(C40,道具表!A:B,2,0)","v":"布鲁斯绿"},12002,1,1,300,null,null,{"$f":"VLOOKUP(J40,道具表!$A:$B,2,0)","v":"萨莉紫S"},11005,1,1,300,null,null,"名称","ID","数量下限","数量上限","权重"]
{"$rows_left_out":47}
{"sheet":"普通召唤","index":3,"n_rows":74,"n_cols":15,"rows_kept":74,"cut":false,"hidden":false,"merged":[]}
["白色英雄库",2001,{"$nulls":5},"白色材料库",2004]
[null,"名称","ID","数量下限","数量上限","权重",null,null,"名称","ID","数量下限","数量上限","权重"]
[null,{"$f":"VLOOKUP(C3,道具表!$A:$B,2,0)","v":"枪兵白"},10101,1,1,1400,null,null,{"$f":"VLOOKUP(J3,道具表!$A:$B,2,0)","v":"小袋金币"},100002,1,1,2500]
[null,{"$f":"VLOOKUP(C4,道具表!$A:$B,2,0)","v":"火枪白"},10301,1,1,1400,null,null,{"$f":"VLOOKUP(J4,道具表!$A:$B,2,0)","v":"少量铁矿石"},140501,1,1,2500]
[null,{"$f":"VLOOKUP(C5,道具表!$A:$B,2,0)","v":"小丑白"},10501,1,1,1400,null,null,{"$f":"VLOOKUP(J5,道具表!$A:$B,2,0)","v":"少量木材"},140601,1,1,2500]
[null,{"$f":"VLOOKUP(C6,道具表!$A:$B,2,0)","v":"史莱姆白"},12501,1,1,1400,null,null,{"$f":"VLOOKUP(J6,道具表!$A:$B,2,0)","v":"少量经验石"},140701,1,1,2500]
[null,{"$f":"VLOOKUP(C7,道具表!$A:$B,2,0)","v":"阿拉丁白"},10801,1,1,1400,{"$nulls":6},{"$f":"SUM(M3:M6)","v":10000},null,{"$f":"_xlfn.TEXTJOIN(\"^\",,J3:J6)","v":"100002^140501^140601^140701"}]
[null,{"$f":"VLOOKUP(C8,道具表!$A:$B,2,0)","v":"黑魔王白"},10901,1,1,300,{"$nulls":8},{"$f":"_xlfn.TEXTJOIN(\"^\",,K3:K6)","v":"1^1^1^1"}]
[null,{"$f":"VLOOKUP(C9,道具表!$A:$B,2,0)","v":"萨莉白"},11001,1,1,300,{"$nulls":8},{"$f":"_xlfn.TEXTJOIN(\"^\",,M3:M6)","v":"2500^2500^2500^2500"}]
[null,{"$f":"VLOOKUP(C10,道具表!$A:$B,2,0)","v":"巨汉白"},11101,1,1,300]
[null,{"$f":"VLOOKUP(C11,道具表!$A:$B,2,0)","v":"布鲁斯白"},12001,1,1,300]
[null,{"$f":"VLOOKUP(C12,道具表!$A:$B,2,0)","v":"奥利尔白"},11201,1,1,300]
[null,{"$f":"VLOOKUP(C13,道具表!$A:$B,2,0)","v":"露娜白"},11501,1,1,300]
[null,{"$f":"VLOOKUP(C14,道具表!$A:$B,2,0)","v":"玛格尼斯白"},11601,1,1,300]
[null,{"$f":"VLOOKUP(C15,道具表!$A:$B,2,0)","v":"特查拉白"},10601,1,1,300]
[null,{"$f":"VLOOKUP(C16,道具表!$A:$B,2,0)","v":"浣熊卫队白"},12101,1,1,100,null,"绿色材料库",2005]
[null,{"$f":"VLOOKUP(C17,道具表!$A:$B,2,0)","v":"玛法里奥白"},11301,1,1,100,null,null,"名称","ID","数量下限","数量上限","权重"]
[null,{"$f":"VLOOKUP(C18,道具表!$A:$B,2,0)","v":"罗宾白"},10401,1,1,100,null,null,{"$f":"VLOOKUP(J18,道具表!$A:$B,2,0)","v":"中袋金币"},100003,1,1,2500]
[null,{"$f":"VLOOKUP(C19,道具表!$A:$B,2,0)","v":"希瓦娜白"},11701,1,1,100,null,null,{"$f":"VLOOKUP(J19,道具表!$A:$B,2,0)","v":"小堆铁矿石"},140502,1,1,2500]
[null,{"$f":"VLOOKUP(C20,道具表!$A:$B,2,0)","v":"铁皮人白"},11901,1,1,100,null,null,{"$f":"VLOOKUP(J20,道具表!$A:$B,2,0)","v":"小堆木材"},140602,1,1,2500]
[null,{"$f":"VLOOKUP(C21,道具表!$A:$B,2,0)","v":"宇智波白"},10701,1,1,100,null,null,{"$f":"VLOOKUP(J21,道具表!$A:$B,2,0)","v":"小堆经验石"},140702,1,1,2500]
[{"$nulls":5},{"$f":"SUM(F3:F21)","v":10000},{"$f":"_xlfn.TEXTJOIN(\"^\",,C3:C21)","v":"10101^10301^10501^12501^10801^10901^11001^11101^12001^11201^11501^11601^10601^12101^11301^10401^11701^11901^10701"},{"$nulls":5},{"$f":"SUM(M18:M21)","v":10000},null,{"$f":"_xlfn.TEXTJOIN(\"^\",,J18:J21)","v":"100003^140502^140602^140702"}]
[{"$nulls":6},{"$f":"_xlfn.TEXTJOIN(\"^\",,D3:D21)","v":"1^1^1^1^1^1^1^1^1^1^1^1^1^1^1^1^1^1^1"},{"$nulls":7},{"$f":"_xlfn.TEXTJOIN(\"^\",,K18:K21)","v":"1^1^1^1"}]
[{"$nulls":14},{"$f":"_xlfn.TEXTJOIN(\"^\",,M18:M21)","v":"2500^2500^2500^2500"}]
[]
[{"$nulls":7},"蓝色材料库",2006]
[{"$nulls":8},"名称","ID","数量下限","数量上限","权重"]
[{"$nulls":8},{"$f":"VLOOKUP(J28,道具表!$A:$B,2,0)","v":"大袋金币"},100004,1,1,2500]
[{"$nulls":8},{"$f":"VLOOKUP(J29,道具表!$A:$B,2,0)","v":"中堆铁矿石"},140503,1,1,2500]
["绿色英雄库",2002,{"$nulls":6},{"$f":"VLOOKUP(J30,道具表!$A:$B,2,0)","v":"中堆木材"},140603,1,1,2500]
[null,"名称","ID","数量下限","数量上限","权重",null,null,{"$f":"VLOOKUP(J31,道具表!$A:$B,2,0)","v":"中堆经验石"},140703,1,1,2500]
[null,{"$f":"VLOOKUP(C32,道具表!A:B,2,0)","v":"枪兵绿"},10102,1,1,1400,{"$nulls":6},{"$f":"SUM(M28:M31)","v":10000},null,{"$f":"_xlfn.TEXTJOIN(\"^\",,J28:J31)","v":"100004^140503^140603^140703"}]
[null,{"$f":"VLOOKUP(C33,道具表!A:B,2,0)","v":"火枪绿"},10302,1,1,1400,{"$nulls":8},{"$f":"_xlfn.TEXTJOIN(\"^\",,K28:K31)","v":"1^1^1^1"}]
[null,{"$f":"VLOOKUP(C34,道具表!A:B,2,0)","v":"小丑绿"},10502,1,1,1400,{"$nulls":8},{"$f":"_xlfn.TEXTJOIN(\"^\",,M28:M31)","v":"2500^2500^2500^2500"}]
[null,{"$f":"VLOOKUP(C35,道具表!A:B,2,0)","v":"史莱姆绿"},12502,1,1,1400]
[null,{"$f":"VLOOKUP(C36,道具表!A:B,2,0)","v":"阿拉丁绿"},10802,1,1,1400]
[null,{"$f":"VLOOKUP(C37,道具表!A:B,2,0)","v":"黑魔王绿"},10902,1,1,300,null,"紫色材料库",2007]
[null,{"$f":"VLOOKUP(C38,道具表!A:B,2,0)","v":"萨莉绿"},11002,1,1,300,null,null,"名称","ID","数量下限","数量上限","权重"]
[null,{"$f":"VLOOKUP(C39,道具表!A:B,2,0)","v":"巨汉绿"},11102,1,1,300,null,null,{"$f":"VLOOKUP(J39,道具表!$A:$B,2,0)","v":"一箱金币"},100005,1,1,2500]
[null,{"$f":"VLOOKUP(C40,道具表!A:B,2,0)","v":"布鲁斯绿"},12002,1,1,300,null,null,{"$f":"VLOOKUP(J40,道具表!$A:$B,2,0)","v":"大堆铁矿石"},140504,1,1,2500]
{"$rows_left_out":35}
{"sheet":"武器召唤","index":4,"n_rows":136,"n_cols":21,"rows_kept":136,"cut":false,"hidden":false,"merged":[]}
["白色英雄库",5001,{"$nulls":5},"蓝色装备库",5003,{"$nulls":5},"紫色装备库",5005]
[null,"名称","ID","数量下限","数量上限","权重",null,null,"名称","ID","数量下限","数量上限","权重",null,null,"名称","ID","数量下限","数量上限","权重"]
[null,{"$f":"VLOOKUP(C3,道具表!$A:$B,2,0)","v":"泣血大剑白"},210101,1,1,149,null,null,{"$f":"VLOOKUP(J3,道具表!$A:$B,2,0)","v":"泣血大剑蓝"},210103,1,1,149,null,null,{"$f":"VLOOKUP(Q3,道具表!$A:$B,2,0)","v":"泣血大剑紫S"},210106,1,1,149]
[null,{"$f":"VLOOKUP(C4,道具表!$A:$B,2,0)","v":"泰坦短剑白"},210201,1,1,74,null,null,{"$f":"VLOOKUP(J4,道具表!$A:$B,2,0)","v":"泰坦短剑蓝"},210203,1,1,74,null,null,{"$f":"VLOOKUP(Q4,道具表!$A:$B,2,0)","v":"泰坦短剑紫S"},210206,1,1,74]
[null,{"$f":"VLOOKUP(C5,道具表!$A:$B,2,0)","v":"追击短弓白"},210301,1,1,223,null,null,{"$f":"VLOOKUP(J5,道具表!$A:$B,2,0)","v":"追击短弓蓝"},210303,1,1,223,null,null,{"$f":"VLOOKUP(Q5,道具表!$A:$B,2,0)","v":"追击短弓紫S"},210306,1,1,223]
[null,{"$f":"VLOOKUP(C6,道具表!$A:$B,2,0)","v":"削骨短刃白"},210401,1,1,149,null,null,{"$f":"VLOOKUP(J6,道具表!$A:$B,2,0)","v":"削骨短刃蓝"},210403,1,1,149,null,null,{"$f":"VLOOKUP(Q6,道具表!$A:$B,2,0)","v":"削骨短刃紫S"},210406,1,1,149]
[null,{"$f":"VLOOKUP(C7,道具表!$A:$B,2,0)","v":"精致长剑白"},210501,1,1,149,null,null,{"$f":"VLOOKUP(J7,道具表!$A:$B,2,0)","v":"精致长剑蓝"},210503,1,1,149,null,null,{"$f":"VLOOKUP(Q7,道具表!$A:$B,2,0)","v":"精致长剑紫S"},210506,1,1,149]
[null,{"$f":"VLOOKUP(C8,道具表!$A:$B,2,0)","v":"精致法杖白"},210601,1,1,149,null,null,{"$f":"VLOOKUP(J8,道具表!$A:$B,2,0)","v":"精致法杖蓝"},210603,1,1,149,null,null,{"$f":"VLOOKUP(Q8,道具表!$A:$B,2,0)","v":"精致法杖紫S"},210606,1,1,149]
[null,{"$f":"VLOOKUP(C9,道具表!$A:$B,2,0)","v":"信仰权杖白"},210701,1,1,300,null,null,{"$f":"VLOOKUP(J9,道具表!$A:$B,2,0)","v":"信仰权杖蓝"},210703,1,1,300,null,null,{"$f":"VLOOKUP(Q9,道具表!$A:$B,2,0)","v":"信仰权杖紫S"},210706,1,1,300]
[null,{"$f":"VLOOKUP(C10,道具表!$A:$B,2,0)","v":"仪式权杖白"},210801,1,1,300,null,null,{"$f":"VLOOKUP(J10,道具表!$A:$B,2,0)","v":"仪式权杖蓝"},210803,1,1,300,null,null,{"$f":"VLOOKUP(Q10,道具表!$A:$B,2,0)","v":"仪式权杖紫S"},210806,1,1,300]
[null,{"$f":"VLOOKUP(C11,道具表!$A:$B,2,0)","v":"荒古法杖白"},210901,1,1,149,null,null,{"$f":"VLOOKUP(J11,道具表!$A:$B,2,0)","v":"荒古法杖蓝"},210903,1,1,149,null,null,{"$f":"VLOOKUP(Q11,道具表!$A:$B,2,0)","v":"荒古法杖紫S"},210906,1,1,149]
[null,{"$f":"VLOOKUP(C12,道具表!$A:$B,2,0)","v":"唤魔法杖白"},211001,1,1,149,null,null,{"$f":"VLOOKUP(J12,道具表!$A:$B,2,0)","v":"唤魔法杖蓝"},211003,1,1,149,null,null,{"$f":"VLOOKUP(Q12,道具表!$A:$B,2,0)","v":"唤魔法杖紫S"},211006,1,1,149]
[null,{"$f":"VLOOKUP(C13,道具表!$A:$B,2,0)","v":"泰坦指环白"},220101,1,1,74,null,null,{"$f":"VLOOKUP(J13,道具表!$A:$B,2,0)","v":"泰坦指环蓝"},220103,1,1,74,null,null,{"$f":"VLOOKUP(Q13,道具表!$A:$B,2,0)","v":"泰坦指环紫S"},220106,1,1,74]
[null,{"$f":"VLOOKUP(C14,道具表!$A:$B,2,0)","v":"迅击戒指白"},220201,1,1,223,null,null,{"$f":"VLOOKUP(J14,道具表!$A:$B,2,0)","v":"迅击戒指蓝"},220203,1,1,223,null,null,{"$f":"VLOOKUP(Q14,道具表!$A:$B,2,0)","v":"迅击戒指紫S"},220206,1,1,223]
[null,{"$f":"VLOOKUP(C15,道具表!$A:$B,2,0)","v":"智慧徽章白"},220301,1,1,74,null,null,{"$f":"VLOOKUP(J15,道具表!$A:$B,2,0)","v":"智慧徽章蓝"},220303,1,1,74,null,null,{"$f":"VLOOKUP(Q15,道具表!$A:$B,2,0)","v":"智慧徽章紫S"},220306,1,1,74]
[null,{"$f":"VLOOKUP(C16,道具表!$A:$B,2,0)","v":"仪式护符白"},220401,1,1,299,null,null,{"$f":"VLOOKUP(J16,道具表!$A:$B,2,0)","v":"仪式护符蓝"},220403,1,1,299,null,null,{"$f":"VLOOKUP(Q16,道具表!$A:$B,2,0)","v":"仪式护符紫S"},220406,1,1,299]
[null,{"$f":"VLOOKUP(C17,道具表!$A:$B,2,0)","v":"荒古吊坠白"},220501,1,1,149,null,null,{"$f":"VLOOKUP(J17,道具表!$A:$B,2,0)","v":"荒古吊坠蓝"},220503,1,1,149,null,null,{"$f":"VLOOKUP(Q17,道具表!$A:$B,2,0)","v":"荒古吊坠紫S"},220506,1,1,149]
[null,{"$f":"VLOOKUP(C18,道具表!$A:$B,2,0)","v":"唤魔项链白"},220601,1,1,149,null,null,{"$f":"VLOOKUP(J18,道具表!$A:$B,2,0)","v":"唤魔项链蓝"},220603,1,1,149,null,null,{"$f":"VLOOKUP(Q18,道具表!$A:$B,2,0)","v":"唤魔项链紫S"},220606,1,1,149]
[null,{"$f":"VLOOKUP(C19,道具表!$A:$B,2,0)","v":"泰坦护腕白"},230101,1,1,74,null,null,{"$f":"VLOOKUP(J19,道具表!$A:$B,2,0)","v":"泰坦护腕蓝"},230103,1,1,74,null,null,{"$f":"VLOOKUP(Q19,道具表!$A:$B,2,0)","v":"泰坦护腕紫S"},230106,1,1,74]
[null,{"$f":"VLOOKUP(C20,道具表!$A:$B,2,0)","v":"迅击护腕白"},230201,1,1,149,null,null,{"$f":"VLOOKUP(J20,道具表!$A:$B,2,0)","v":"迅击护腕蓝"},230203,1,1,149,null,null,{"$f":"VLOOKUP(Q20,道具表!$A:$B,2,0)","v":"迅击护腕紫S"},230206,1,1,149]
[null,{"$f":"VLOOKUP(C21,道具表!$A:$B,2,0)","v":"贪婪护腕白"},230301,1,1,447,null,null,{"$f":"VLOOKUP(J21,道具表!$A:$B,2,0)","v":"贪婪护腕蓝"},230303,1,1,447,null,null,{"$f":"VLOOKUP(Q21,道具表!$A:$B,2,0)","v":"贪婪护腕紫S"},230306,1,1,447]
[null,{"$f":"VLOOKUP(C22,道具表!$A:$B,2,0)","v":"仪式护腕白"},230401,1,1,299,null,null,{"$f":"VLOOKUP(J22,道具表!$A:$B,2,0)","v":"仪式护腕蓝"},230403,1,1,299,null,null,{"$f":"VLOOKUP(Q22,道具表!$A:$B,2,0)","v":"仪式护腕紫S"},230406,1,1,299]
[null,{"$f":"VLOOKUP(C23,道具表!$A:$B,2,0)","v":"荒古护腕白"},230501,1,1,149,null,null,{"$f":"VLOOKUP(J23,道具表!$A:$B,2,0)","v":"荒古护腕蓝"},230503,1,1,149,null,null,{"$f":"VLOOKUP(Q23,道具表!$A:$B,2,0)","v":"荒古护腕紫S"},230506,1,1,149]
[null,{"$f":"VLOOKUP(C24,道具表!$A:$B,2,0)","v":"洞察护腕白"},230601,1,1,447,null,null,{"$f":"VLOOKUP(J24,道具表!$A:$B,2,0)","v":"洞察护腕蓝"},230603,1,1,447,null,null,{"$f":"VLOOKUP(Q24,道具表!$A:$B,2,0)","v":"洞察护腕紫S"},230606,1,1,447]
[null,{"$f":"VLOOKUP(C25,道具表!$A:$B,2,0)","v":"精致丝甲白"},240101,1,1,300,null,null,{"$f":"VLOOKUP(J25,道具表!$A:$B,2,0)","v":"精致丝甲蓝"},240103,1,1,300,null,null,{"$f":"VLOOKUP(Q25,道具表!$A:$B,2,0)","v":"精致丝甲紫S"},240106,1,1,300]
[null,{"$f":"VLOOKUP(C26,道具表!$A:$B,2,0)","v":"极限皮甲白"},240201,1,1,300,null,null,{"$f":"VLOOKUP(J26,道具表!$A:$B,2,0)","v":"极限皮甲蓝"},240203,1,1,300,null,null,{"$f":"VLOOKUP(Q26,道具表!$A:$B,2,0)","v":"极限皮甲紫S"},240206,1,1,300]
[null,{"$f":"VLOOKUP(C27,道具表!$A:$B,2,0)","v":"荆棘护甲白"},240301,1,1,374,null,null,{"$f":"VLOOKUP(J27,道具表!$A:$B,2,0)","v":"荆棘护甲蓝"},240303,1,1,374,null,null,{"$f":"VLOOKUP(Q27,道具表!$A:$B,2,0)","v":"荆棘护甲紫S"},240306,1,1,374]
[null,{"$f":"VLOOKUP(C28,道具表!$A:$B,2,0)","v":"永夜圣衣白"},240401,1,1,374,null,null,{"$f":"VLOOKUP(J28,道具表!$A:$B,2,0)","v":"永夜圣衣蓝"},240403,1,1,374,null,null,{"$f":"VLOOKUP(Q28,道具表!$A:$B,2,0)","v":"永夜圣衣紫S"},240406,1,1,374]
[null,{"$f":"VLOOKUP(C29,道具表!$A:$B,2,0)","v":"浴血长袍白"},240501,1,1,299,null,null,{"$f":"VLOOKUP(J29,道具表!$A:$B,2,0)","v":"浴血长袍蓝"},240503,1,1,299,null,null,{"$f":"VLOOKUP(Q29,道具表!$A:$B,2,0)","v":"浴血长袍紫S"},240506,1,1,299]
[null,{"$f":"VLOOKUP(C30,道具表!$A:$B,2,0)","v":"庇护圣甲白"},240601,1,1,149,null,null,{"$f":"VLOOKUP(J30,道具表!$A:$B,2,0)","v":"庇护圣甲蓝"},240603,1,1,149,null,null,{"$f":"VLOOKUP(Q30,道具表!$A:$B,2,0)","v":"庇护圣甲紫S"},240606,1,1,149]
[null,{"$f":"VLOOKUP(C31,道具表!$A:$B,2,0)","v":"极限腰带白"},250101,1,1,373,null,null,{"$f":"VLOOKUP(J31,道具表!$A:$B,2,0)","v":"极限腰带蓝"},250103,1,1,373,null,null,{"$f":"VLOOKUP(Q31,道具表!$A:$B,2,0)","v":"极限腰带紫S"},250106,1,1,373]
[null,{"$f":"VLOOKUP(C32,道具表!$A:$B,2,0)","v":"贪婪腰带白"},250201,1,1,447,null,null,{"$f":"VLOOKUP(J32,道具表!$A:$B,2,0)","v":"贪婪腰带蓝"},250203,1,1,447,null,null,{"$f":"VLOOKUP(Q32,道具表!$A:$B,2,0)","v":"贪婪腰带紫S"},250206,1,1,447]
[null,{"$f":"VLOOKUP(C33,道具表!$A:$B,2,0)","v":"血护腰带白"},250301,1,1,223,null,null,{"$f":"VLOOKUP(J33,道具表!$A:$B,2,0)","v":"血护腰带蓝"},250303,1,1,223,null,null,{"$f":"VLOOKUP(Q33,道具表!$A:$B,2,0)","v":"血护腰带紫S"},250306,1,1,223]
[null,{"$f":"VLOOKUP(C34,道具表!$A:$B,2,0)","v":"野性皮带白"},250401,1,1,300,null,null,{"$f":"VLOOKUP(J34,道具表!$A:$B,2,0)","v":"野性皮带蓝"},250403,1,1,300,null,null,{"$f":"VLOOKUP(Q34,道具表!$A:$B,2,0)","v":"野性皮带紫S"},250406,1,1,300]
[null,{"$f":"VLOOKUP(C35,道具表!$A:$B,2,0)","v":"征战腰带白"},250501,1,1,300,null,null,{"$f":"VLOOKUP(J35,道具表!$A:$B,2,0)","v":"征战腰带蓝"},250503,1,1,300,null,null,{"$f":"VLOOKUP(Q35,道具表!$A:$B,2,0)","v":"征战腰带紫S"},250506,1,1,300]
[null,{"$f":"VLOOKUP(C36,道具表!$A:$B,2,0)","v":"破碎皮带白"},250601,1,1,373,null,null,{"$f":"VLOOKUP(J36,道具表!$A:$B,2,0)","v":"破碎皮带蓝"},250603,1,1,373,null,null,{"$f":"VLOOKUP(Q36,道具表!$A:$B,2,0)","v":"破碎皮带紫S"},250606,1,1,373]
[null,{"$f":"VLOOKUP(C37,道具表!$A:$B,2,0)","v":"极限短靴白"},260101,1,1,299,null,null,{"$f":"VLOOKUP(J37,道具表!$A:$B,2,0)","v":"极限短靴蓝"},260103,1,1,299,null,null,{"$f":"VLOOKUP(Q37,道具表!$A:$B,2,0)","v":"极限短靴紫S"},260106,1,1,299]
[null,{"$f":"VLOOKUP(C38,道具表!$A:$B,2,0)","v":"唤魔便靴白"},260201,1,1,149,null,null,{"$f":"VLOOKUP(J38,道具表!$A:$B,2,0)","v":"唤魔便靴蓝"},260203,1,1,149,null,null,{"$f":"VLOOKUP(Q38,道具表!$A:$B,2,0)","v":"唤魔便靴紫S"},260206,1,1,149]
[null,{"$f":"VLOOKUP(C39,道具表!$A:$B,2,0)","v":"元素长靴白"},260301,1,1,149,null,null,{"$f":"VLOOKUP(J39,道具表!$A:$B,2,0)","v":"元素长靴蓝"},260303,1,1,149,null,null,{"$f":"VLOOKUP(Q39,道具表!$A:$B,2,0)","v":"元素长靴紫S"},260306,1,1,149]
[null,{"$f":"VLOOKUP(C40,道具表!$A:$B,2,0)","v":"侍候短靴白"},260401,1,1,447,null,null,{"$f":"VLOOKUP(J40,道具表!$A:$B,2,0)","v":"侍候短靴蓝"},260403,1,1,447,null,null,{"$f":"VLOOKUP(Q40,道具表!$A:$B,2,0)","v":"侍候短靴紫S"},260406,1,1,447]
{"$rows_left_out":97}
{"sheet":"道具表","index":5,"n_rows":832,"n_cols":6,"rows_kept":832,"cut":false,"hidden":false,"merged":[]}
[100001,"金币","大陆通用货币，可用于英雄升级"]
[110001,"体力","体力，可用于冒险闯关消耗"]
[110002,"能量点","能量点，用于战斗中召唤英雄卡牌"]
[110003,"活跃度","活跃度，达到一定值可领取活跃宝箱"]
[110004,"周积分","周常积分，达到一定值可领取活跃宝箱"]
[110005,"爬塔积分","爬塔积分，可在积分商店兑换物品"]
[130001,"钻石","流通的高级货币，可通过充值、活动或任务奖励获得"]
[140001,"铁矿","升级建筑所需材料"]
[140002,"木材","升级建筑所需材料"]
[140003,"队伍经验","队伍等级升级所需消耗"]
[140004,"经验石","英雄升级所需消耗"]
[140005,"技能书","技能卡牌升级所需消耗"]
[140006,"天赋石","特殊天赋激活必须的物品"]
[140007,"武器卷轴","可用于武器的强化消耗"]
[140008,"首饰卷轴","可用于首饰的强化消耗"]
[140009,"护腕卷轴","可用于护腕的强化消耗"]
[140010,"护甲卷轴","可用于护甲的强化消耗"]
[140011,"腰带卷轴","可用于腰带的强化消耗"]
[140012,"鞋子卷轴","可用于鞋子的强化消耗"]
[140013,"精英英雄","重置精英英雄留下的证明，用于精英英雄突破时所需材料"]
[140014,"神话英雄","重置神话英雄留下的证明，用于神话英雄突破时所需材料"]
[140015,"传说英雄","重置传说英雄留下的证明，用于传说英雄突破时所需材料"]
[140016,"武器稀有配件","回退稀有武器留下的配件，用于稀有武器突破时所需材料"]
[140017,"首饰稀有配件","回退稀有首饰留下的配件，用于稀有首饰突破时所需材料"]
[140018,"护腕稀有配件","回退稀有护腕留下的配件，用于稀有护腕突破时所需材料"]
[140019,"护甲稀有配件","回退稀有护甲留下的配件，用于稀有护甲突破时所需材料"]
[140020,"腰带稀有配件","回退稀有腰带留下的配件，用于稀有腰带突破时所需材料"]
[140021,"鞋子稀有配件","回退稀有鞋子留下的配件，用于稀有鞋子突破时所需材料"]
[140022,"武器传说配件","回退传说武器留下的配件，用于传说武器突破时所需材料"]
[140023,"首饰传说配件","回退传说首饰留下的配件，用于传说首饰突破时所需材料"]
[140024,"护腕传说配件","回退传说护腕留下的配件，用于传说护腕突破时所需材料"]
[140025,"护甲传说配件","回退传说护甲留下的配件，用于传说护甲突破时所需材料"]
[140026,"腰带传说配件","回退传说腰带留下的配件，用于传说腰带突破时所需材料"]
[140027,"鞋子传说配件","回退传说鞋子留下的配件，用于传说鞋子突破时所需材料"]
[140028,"武器神话配件","回退神话武器留下的配件，用于神话武器突破时所需材料"]
[140029,"首饰神话配件","回退神话首饰留下的配件，用于神话首饰突破时所需材料"]
[140030,"护腕神话配件","回退神话护腕留下的配件，用于神话护腕突破时所需材料"]
[140031,"护甲神话配件","回退神话护甲留下的配件，用于神话护甲突破时所需材料"]
[140032,"腰带神话配件","回退神话腰带留下的配件，用于神话腰带突破时所需材料"]
[140033,"鞋子神话配件","回退神话鞋子留下的配件，用于神话鞋子突破时所需材料"]
{"$rows_left_out":792}